BDBM50196337 2,2-Dimethyl-propionic acid 2-(3,4-dimethyl-benzyl)-3-[3-(4-hydroxy-3-methoxy-benzyl)-thioureido]-propyl ester::2-((3-(4-hydroxy-3-methoxybenzyl)thioureido)methyl)-3-(3,4-dimethylphenyl)propyl pivalate::CHEMBL392495
SMILES COc1cc(CNC(=S)NCC(COC(=O)C(C)(C)C)Cc2ccc(C)c(C)c2)ccc1O
InChI Key InChIKey=KDYVIORLSJSMTG-UHFFFAOYSA-N
Data  3 KI  2 EC50
  Tab Delimited (TSV)   2D SDfile   Computed 3D by Vconf -m prep SDfile
Find this compound or compounds like it in BindingDB:
Activity Spreadsheet -- Enzyme Inhibition Constant Data from BindingDB
Found 5 hits for monomerid = 50196337
TargetTransient receptor potential cation channel subfamily V member 1(Homo sapiens (Human))
Hospital Of The University Of Pennsylvania
Curated by ChEMBL
LigandPNGBDBM50196337(2,2-Dimethyl-propionic acid 2-(3,4-dimethyl-benzyl...)
Affinity DataKi: <10nM. Assay description: Agonistic activity against vanilloid receptor 1 (TRPV1)
In DepthDetails ArticlePubMed
TargetTransient receptor potential cation channel subfamily V member 1(Rattus norvegicus (rat))
Seoul National University
Curated by ChEMBL
LigandPNGBDBM50196337(2,2-Dimethyl-propionic acid 2-(3,4-dimethyl-benzyl...)
Affinity DataKi:  17nM. Assay description: Displacement of [3H]RTX from rat TRPV1 expressed in CHO cells
In DepthDetails ArticlePubMed
TargetTransient receptor potential cation channel subfamily V member 1(Rattus norvegicus (rat))
Seoul National University
Curated by ChEMBL
LigandPNGBDBM50196337(2,2-Dimethyl-propionic acid 2-(3,4-dimethyl-benzyl...)
Affinity DataKi:  17.4nM. Assay description: In vitro binding affinity towards Rat Vanilloid receptor 1 (VR1) by [3H]-RTX displacement.
In DepthDetails ArticlePubMed
TargetTransient receptor potential cation channel subfamily V member 1(Rattus norvegicus (rat))
Seoul National University
Curated by ChEMBL
LigandPNGBDBM50196337(2,2-Dimethyl-propionic acid 2-(3,4-dimethyl-benzyl...)
Affinity DataEC50:  2nM. Assay description: Agonist activity at rat TRPV1 expressed in CHO cells assessed as maximal calcium uptake
In DepthDetails ArticlePubMed
TargetTransient receptor potential cation channel subfamily V member 1(Rattus norvegicus (rat))
Seoul National University
Curated by ChEMBL
LigandPNGBDBM50196337(2,2-Dimethyl-propionic acid 2-(3,4-dimethyl-benzyl...)
Affinity DataEC50:  1.97nM. Assay description: In vitro [Ca2+] influx relative to capsaicin by Rat Vanilloid receptor (VR1) expressing CHO cells
In DepthDetails ArticlePubMed