BDBM50196524 CHEMBL3968646::US10167270, Compound 11c
SMILES Cc1ccc(cn1)-c1nc(NC2Cc3ccccc3C2)c2ccccc2n1
InChI Key InChIKey=SNPORVMVKFFDMI-UHFFFAOYSA-N
Data  2 IC50
  Tab Delimited (TSV)   2D SDfile   Computed 3D by Vconf -m prep SDfile
Find this compound or compounds like it in BindingDB:
Activity Spreadsheet -- Enzyme Inhibition Constant Data from BindingDB
Found 2 hits for monomerid = 50196524
TargetLysosomal acid glucosylceramidase(Homo sapiens (Human))
Northwestern University
US Patent
LigandPNGBDBM50196524(CHEMBL3968646 | US10167270, Compound 11c)
Affinity DataIC50:  29.4nM. Assay description: The enzyme in GCase enzyme activity buffer (25 μL/well) was added to a 384-well black plate. The fluorescent probe 3 (25 nL/well, 50 nM final co...
In DepthDetails US Patent
TargetLysosomal acid glucosylceramidase(Homo sapiens (Human))
Northwestern University
US Patent
LigandPNGBDBM50196524(CHEMBL3968646 | US10167270, Compound 11c)
Affinity DataIC50:  29nMpH: 5.9Assay Description:Inhibition of synthetic recombinant wild type GCase enzyme velaglucerase alfa (unknown origin) at pH 5.9 preincubated for 5 mins followed by addition...
In DepthDetails ArticlePubMed