BDBM50196873 CHEMBL3924218
SMILES Cl.COc1ccc(C(=O)CC(C)C)c(OC[C@H](O)CNC(C)C)c1
InChI Key InChIKey=ATFMDVYPKZACHW-PFEQFJNWSA-N
Data  1 IC50
  Tab Delimited (TSV)   2D SDfile   Computed 3D by Vconf -m prep SDfile
Find this compound or compounds like it in BindingDB:
Activity Spreadsheet -- Enzyme Inhibition Constant Data from BindingDB
Found 1 hit for monomerid = 50196873
TargetProto-oncogene tyrosine-protein kinase Src(Mus musculus (Mouse))
Chinese Academy Of Medical Sciences And Peking Union Medical College
Curated by ChEMBL
LigandPNGBDBM50196873(CHEMBL3924218)
Affinity DataIC50:  4.09E+4nM. Assay description: Inhibition of Src in mouse BV2 cells assessed as suppression of LPS-induced NO release preincubated for 1 hr followed by LPS addition measured after ...
In DepthDetails ArticlePubMed