BDBM50196891 CHEMBL3910388
SMILES Cl.Oc1cc(O)c(C(=O)CCCN2CCCCC2)c(O)c1
InChI Key InChIKey=NNCONKQAAJWZFZ-UHFFFAOYSA-N
Data  1 IC50
  Tab Delimited (TSV)   2D SDfile   Computed 3D by Vconf -m prep SDfile
Find this compound or compounds like it in BindingDB:
Activity Spreadsheet -- Enzyme Inhibition Constant Data from BindingDB
Found 1 hit for monomerid = 50196891
TargetProto-oncogene tyrosine-protein kinase Src(Mus musculus (Mouse))
Chinese Academy Of Medical Sciences And Peking Union Medical College
Curated by ChEMBL
LigandPNGBDBM50196891(CHEMBL3910388)
Affinity DataIC50:  1.82E+5nM. Assay description: Inhibition of Src in mouse BV2 cells assessed as suppression of LPS-induced NO release preincubated for 1 hr followed by LPS addition measured after ...
In DepthDetails ArticlePubMed