BDBM50197710 CHEMBL3959997
SMILES Cc1cc2cc(ccc2[nH]1)-n1ncc(C(=O)c2cc3ccccc3[nH]2)c1N
InChI Key InChIKey=QIASHDRGDBMNGW-UHFFFAOYSA-N
Data  6 IC50
  Tab Delimited (TSV)   2D SDfile   Computed 3D by Vconf -m prep SDfile
Find this compound or compounds like it in BindingDB:
Activity Spreadsheet -- Enzyme Inhibition Constant Data from BindingDB
Found 6 hits for monomerid = 50197710
TargetFibroblast growth factor receptor 4(Homo sapiens (Human))
Chugai Pharmaceutical
Curated by ChEMBL
LigandPNGBDBM50197710(CHEMBL3959997)
Affinity DataIC50:  85nM. Assay description: Inhibition of human FGFR4 by time-resolved fluorescence or time-resolved fluorescence assay
In DepthDetails ArticlePubMed
TargetFibroblast growth factor receptor 2(Homo sapiens (Human))
Chugai Pharmaceutical
Curated by ChEMBL
LigandPNGBDBM50197710(CHEMBL3959997)
Affinity DataIC50:  32nM. Assay description: Inhibition of human FGFR2 by time-resolved fluorescence or time-resolved fluorescence assay
In DepthDetails ArticlePubMed
TargetFibroblast growth factor receptor 1(Homo sapiens (Human))
Chugai Pharmaceutical
Curated by ChEMBL
LigandPNGBDBM50197710(CHEMBL3959997)
Affinity DataIC50:  69nM. Assay description: Inhibition of human FGFR1 by time-resolved fluorescence or time-resolved fluorescence assay
In DepthDetails ArticlePubMed
TargetProto-oncogene tyrosine-protein kinase Src(Homo sapiens (Human))
Chugai Pharmaceutical
Curated by ChEMBL
LigandPNGBDBM50197710(CHEMBL3959997)
Affinity DataIC50:  330nM. Assay description: Inhibition of human SRC by time-resolved fluorescence or time-resolved fluorescence assay
In DepthDetails ArticlePubMed
TargetFibroblast growth factor receptor 3(Homo sapiens (Human))
Chugai Pharmaceutical
Curated by ChEMBL
LigandPNGBDBM50197710(CHEMBL3959997)
Affinity DataIC50:  18nM. Assay description: Inhibition of human FGFR3 by time-resolved fluorescence or time-resolved fluorescence assay
In DepthDetails ArticlePubMed
TargetVascular endothelial growth factor receptor 2(Homo sapiens (Human))
Chugai Pharmaceutical
Curated by ChEMBL
LigandPNGBDBM50197710(CHEMBL3959997)
Affinity DataIC50:  6.5nM. Assay description: Inhibition of human KDR by time-resolved fluorescence or time-resolved fluorescence assay
In DepthDetails ArticlePubMed