BDBM50198233 2-((3-iodophenyl)(2-methoxyphenoxy)methyl)morpholine::CHEMBL247687
SMILES COc1ccccc1OC(C1CNCCO1)c1cccc(I)c1
InChI Key InChIKey=MGRHQJGGNQRJSA-UHFFFAOYSA-N
Data  2 KI
  Tab Delimited (TSV)   2D SDfile   Computed 3D by Vconf -m prep SDfile
Find this compound or compounds like it in BindingDB:
Activity Spreadsheet -- Enzyme Inhibition Constant Data from BindingDB
Found 2 hits for monomerid = 50198233
TargetTransporter(Rattus norvegicus)
Institute For Degenerative Diseases
Curated by ChEMBL
LigandPNGBDBM50198233(2-((3-iodophenyl)(2-methoxyphenoxy)methyl)morpholi...)
Affinity DataKi:  15.4nM. Assay description: Displacement of [3H]nisoxetine from NET in rat brain membranes
In DepthDetails ArticlePubMed
TargetSodium-dependent dopamine transporter(Rattus norvegicus (rat))
Institute For Degenerative Diseases
Curated by ChEMBL
LigandPNGBDBM50198233(2-((3-iodophenyl)(2-methoxyphenoxy)methyl)morpholi...)
Affinity DataKi: >1.00E+4nM. Assay description: Displacement of [3H]GBR from DAT in rat brain membranes
In DepthDetails ArticlePubMed