BDBM50200505 CHEMBL3942696
SMILES Clc1ccccc1CNC(=O)[C@H](CCc1ccccc1)NC(=O)[C@H](CCc1ccccc1)NC(=O)N1CCC(CC1)C(=O)Nc1cnccn1
InChI Key InChIKey=XGJUAKXHGRPEBG-LQJZCPKCSA-N
Data  1 IC50
  Tab Delimited (TSV)   2D SDfile   Computed 3D by Vconf -m prep SDfile
Find this compound or compounds like it in BindingDB:
Activity Spreadsheet -- Enzyme Inhibition Constant Data from BindingDB
Found 1 hit for monomerid = 50200505
TargetProteasome subunit beta type-5(Homo sapiens (Human))
Hangzhou Xixi Hospital
Curated by ChEMBL
LigandPNGBDBM50200505(CHEMBL3942696)
Affinity DataIC50:  15nM. Assay description: Inhibition of chymotrypsin-like activity of human 20S proteasome preincubated for 15 mins followed by addition of Suc-Leu-Leu-Val-Tyr-AMC as substrat...
In DepthDetails ArticlePubMed