BDBM50201001 1-[5-(triphenylmethoxy)pentyl]thymine::CHEMBL216997
SMILES Cc1cn(CCCCCOC(c2ccccc2)(c2ccccc2)c2ccccc2)c(=O)[nH]c1=O
InChI Key InChIKey=SLJLMYFAIDHROH-UHFFFAOYSA-N
Data  3 IC50
  Tab Delimited (TSV)   2D SDfile   Computed 3D by Vconf -m prep SDfile
Find this compound or compounds like it in BindingDB:
Activity Spreadsheet -- Enzyme Inhibition Constant Data from BindingDB
Found 3 hits for monomerid = 50201001
TargetDeoxynucleoside kinase(Drosophila melanogaster)
Instituto De QuíMica MéDica (Csic)
Curated by ChEMBL
LigandPNGBDBM50201001(1-[5-(triphenylmethoxy)pentyl]thymine | CHEMBL2169...)
Affinity DataIC50:  1.50E+4nM. Assay description: Inhibition of [3H]methyl dThd phosphorylation by Drosophila melanogaster dNK
In DepthDetails ArticlePubMed
TargetThymidine kinase(Human herpesvirus 1 (strain SC16) (HHV-1) (Human h...)
Instituto De QuíMica MéDica (Csic)
Curated by ChEMBL
LigandPNGBDBM50201001(1-[5-(triphenylmethoxy)pentyl]thymine | CHEMBL2169...)
Affinity DataIC50:  3.20E+4nM. Assay description: Inhibition of [3H]methyl dThd phosphorylation by HSV1 TK
In DepthDetails ArticlePubMed
TargetThymidine kinase 2, mitochondrial(Homo sapiens (Human))
Instituto De QuíMica MéDica (Csic)
Curated by ChEMBL
LigandPNGBDBM50201001(1-[5-(triphenylmethoxy)pentyl]thymine | CHEMBL2169...)
Affinity DataIC50:  2.50E+3nM. Assay description: Inhibition of [3H]methyl dThd phosphorylation by TK2
In DepthDetails ArticlePubMed