BDBM50201315 2-(4-(4-aminothieno[3,2-c]pyridin-3-yl)phenyl)-N-m-tolylacetamide::CHEMBL231357
SMILES Cc1cccc(NC(=O)Cc2ccc(cc2)-c2csc3ccnc(N)c23)c1
InChI Key InChIKey=GVEFXOFPHJTMJZ-UHFFFAOYSA-N
Data  1 IC50
  Tab Delimited (TSV)   2D SDfile   Computed 3D by Vconf -m prep SDfile
Find this compound or compounds like it in BindingDB:
Activity Spreadsheet -- Enzyme Inhibition Constant Data from BindingDB
Found 1 hit for monomerid = 50201315
TargetVascular endothelial growth factor receptor 2(Homo sapiens (Human))
Abbott Laboratories
Curated by ChEMBL
LigandPNGBDBM50201315(2-(4-(4-aminothieno[3,2-c]pyridin-3-yl)phenyl)-N-m...)
Affinity DataIC50:  94nM. Assay description: Inhibition of KDR
In DepthDetails ArticlePubMed