BDBM50201317 1-(4-(4-aminothieno[3,2-c]pyridin-3-yl)phenyl)-3-phenylurea::CHEMBL231255
SMILES Nc1nccc2scc(-c3ccc(NC(=O)Nc4ccccc4)cc3)c12
InChI Key InChIKey=YQQLLLJHDXFGPW-UHFFFAOYSA-N
Data  2 IC50
  Tab Delimited (TSV)   2D SDfile   Computed 3D by Vconf -m prep SDfile
Find this compound or compounds like it in BindingDB:
Activity Spreadsheet -- Enzyme Inhibition Constant Data from BindingDB
Found 2 hits for monomerid = 50201317
TargetVascular endothelial growth factor receptor 2(Homo sapiens (Human))
Abbott Laboratories
Curated by ChEMBL
LigandPNGBDBM50201317(1-(4-(4-aminothieno[3,2-c]pyridin-3-yl)phenyl)-3-p...)
Affinity DataIC50:  72nM. Assay description: Inhibition of human KDR phosphorylation in NIH3T3 cells
In DepthDetails ArticlePubMed
TargetVascular endothelial growth factor receptor 2(Homo sapiens (Human))
Abbott Laboratories
Curated by ChEMBL
LigandPNGBDBM50201317(1-(4-(4-aminothieno[3,2-c]pyridin-3-yl)phenyl)-3-p...)
Affinity DataIC50:  56nM. Assay description: Inhibition of KDR
In DepthDetails ArticlePubMed