BDBM50201320 1-(4-(4-aminothieno[3,2-c]pyridin-3-yl)phenyl)-3-(3,5-dimethylphenyl)urea::CHEMBL231309
SMILES Cc1cc(C)cc(NC(=O)Nc2ccc(cc2)-c2csc3ccnc(N)c23)c1
InChI Key InChIKey=FUTLNLFZIZUFGB-UHFFFAOYSA-N
Data  2 IC50
  Tab Delimited (TSV)   2D SDfile   Computed 3D by Vconf -m prep SDfile
Find this compound or compounds like it in BindingDB:
Activity Spreadsheet -- Enzyme Inhibition Constant Data from BindingDB
Found 2 hits for monomerid = 50201320
TargetVascular endothelial growth factor receptor 2(Homo sapiens (Human))
Abbott Laboratories
Curated by ChEMBL
LigandPNGBDBM50201320(1-(4-(4-aminothieno[3,2-c]pyridin-3-yl)phenyl)-3-(...)
Affinity DataIC50:  16nM. Assay description: Inhibition of KDR
In DepthDetails ArticlePubMed
TargetVascular endothelial growth factor receptor 2(Homo sapiens (Human))
Abbott Laboratories
Curated by ChEMBL
LigandPNGBDBM50201320(1-(4-(4-aminothieno[3,2-c]pyridin-3-yl)phenyl)-3-(...)
Affinity DataIC50:  48nM. Assay description: Inhibition of human KDR phosphorylation in NIH3T3 cells
In DepthDetails ArticlePubMed