BDBM50201331 1-(4-(4-aminothieno[3,2-c]pyridin-3-yl)phenyl)-3-o-tolylurea::CHEMBL394789
SMILES Cc1ccccc1NC(=O)Nc1ccc(cc1)-c1csc2ccnc(N)c12
InChI Key InChIKey=JYMFGIUOAGXDFP-UHFFFAOYSA-N
Data  1 IC50
  Tab Delimited (TSV)   2D SDfile   Computed 3D by Vconf -m prep SDfile
Find this compound or compounds like it in BindingDB:
Activity Spreadsheet -- Enzyme Inhibition Constant Data from BindingDB
Found 1 hit for monomerid = 50201331
TargetVascular endothelial growth factor receptor 2(Homo sapiens (Human))
Abbott Laboratories
Curated by ChEMBL
LigandPNGBDBM50201331(1-(4-(4-aminothieno[3,2-c]pyridin-3-yl)phenyl)-3-o...)
Affinity DataIC50:  152nM. Assay description: Inhibition of KDR
In DepthDetails ArticlePubMed