BDBM50202256 CHEMBL3936124
SMILES C[C@@H](N)C(=O)N1CCC(CC1)c1nc(nc(n1)-n1c(nc2ccccc12)C(F)F)N1CCOCC1
InChI Key InChIKey=OMYRHUCIBLXTRT-CQSZACIVSA-N
Data  2 IC50
  Tab Delimited (TSV)   2D SDfile   Computed 3D by Vconf -m prep SDfile
Find this compound or compounds like it in BindingDB:
Activity Spreadsheet -- Enzyme Inhibition Constant Data from BindingDB
Found 2 hits for monomerid = 50202256
TargetPhosphatidylinositol 4,5-bisphosphate 3-kinase catalytic subunit beta isoform(Homo sapiens (Human))
Monash University
Curated by ChEMBL
LigandPNGBDBM50202256(CHEMBL3936124)
Affinity DataIC50:  3.20E+3nM. Assay description: Inhibition of PI3Kbeta (unknown origin) expressed in Escherichia coli-infected fall armyworm sf21 cells co-expressing p85 by kinase-glo luminescence ...
In DepthDetails ArticlePubMed
TargetPhosphatidylinositol 4,5-bisphosphate 3-kinase catalytic subunit delta isoform(Homo sapiens (Human))
Monash University
Curated by ChEMBL
LigandPNGBDBM50202256(CHEMBL3936124)
Affinity DataIC50:  740nM. Assay description: Inhibition of PI3Kdelta (unknown origin) expressed in Escherichia coli-infected fall armyworm sf21 cells co-expressing p85 by kinase-glo luminescence...
In DepthDetails ArticlePubMed