BDBM50202261 CHEMBL3908177
SMILES FC(F)c1nc2ccccc2n1-c1nc(nc(n1)N1CCOCC1)C1CCN(CC1)C(=O)[C@@H]1CCCN1
InChI Key InChIKey=QIJZPPSARFFUJH-SFHVURJKSA-N
Data  1 IC50
  Tab Delimited (TSV)   2D SDfile   Computed 3D by Vconf -m prep SDfile
Find this compound or compounds like it in BindingDB:
Activity Spreadsheet -- Enzyme Inhibition Constant Data from BindingDB
Found 1 hit for monomerid = 50202261
TargetPhosphatidylinositol 4,5-bisphosphate 3-kinase catalytic subunit beta isoform(Homo sapiens (Human))
Monash University
Curated by ChEMBL
LigandPNGBDBM50202261(CHEMBL3908177)
Affinity DataIC50:  2.00E+3nM. Assay description: Inhibition of PI3Kbeta (unknown origin) expressed in Escherichia coli-infected fall armyworm sf21 cells co-expressing p85 by kinase-glo luminescence ...
In DepthDetails ArticlePubMed