BDBM50202263 CHEMBL3948855
SMILES NC1CCCN(C1)c1nc(nc(n1)-n1c(nc2ccccc12)C(F)F)N1CCOCC1
InChI Key InChIKey=YYQCTPAAXICISH-UHFFFAOYSA-N
Data  1 IC50
  Tab Delimited (TSV)   2D SDfile   Computed 3D by Vconf -m prep SDfile
Find this compound or compounds like it in BindingDB:
Activity Spreadsheet -- Enzyme Inhibition Constant Data from BindingDB
Found 1 hit for monomerid = 50202263
TargetPhosphatidylinositol 4,5-bisphosphate 3-kinase catalytic subunit beta isoform(Homo sapiens (Human))
Monash University
Curated by ChEMBL
LigandPNGBDBM50202263(CHEMBL3948855)
Affinity DataIC50:  554nM. Assay description: Inhibition of PI3Kbeta (unknown origin) expressed in Escherichia coli-infected fall armyworm sf21 cells co-expressing p85 by kinase-glo luminescence ...
In DepthDetails ArticlePubMed