BDBM50202795 CHEMBL245625::N-(3,5-bis(trifluoromethyl)benzyl)-4-(2,2,2-trifluoroacetyl)benzamide
SMILES FC(F)(F)C(=O)c1ccc(cc1)C(=O)NCc1cc(cc(c1)C(F)(F)F)C(F)(F)F
InChI Key InChIKey=ZMJQSDPZKNHQTQ-UHFFFAOYSA-N
Data  1 IC50
  Tab Delimited (TSV)   2D SDfile   Computed 3D by Vconf -m prep SDfile
Find this compound or compounds like it in BindingDB:
Activity Spreadsheet -- Enzyme Inhibition Constant Data from BindingDB
Found 1 hit for monomerid = 50202795
TargetMalonyl-CoA decarboxylase, mitochondrial(Homo sapiens (Human))
Chugai Pharma Usa
Curated by ChEMBL
LigandPNGBDBM50202795(CHEMBL245625 | N-(3,5-bis(trifluoromethyl)benzyl)-...)
Affinity DataIC50:  654nM. Assay description: Inhibition of MBP fused human MCD
In DepthDetails ArticlePubMed