BDBM50202806 2-(N-isobutyl-4-(2,2,2-trifluoroacetyl)benzamido)ethyl 3-nitrobenzoate::CHEMBL392724
SMILES CC(C)CN(CCOC(=O)c1cccc(c1)[N+]([O-])=O)C(=O)c1ccc(cc1)C(=O)C(F)(F)F
InChI Key InChIKey=JODMXIJDFMCVGN-UHFFFAOYSA-N
Data  1 IC50
  Tab Delimited (TSV)   2D SDfile   Computed 3D by Vconf -m prep SDfile
Find this compound or compounds like it in BindingDB:
Activity Spreadsheet -- Enzyme Inhibition Constant Data from BindingDB
Found 1 hit for monomerid = 50202806
TargetMalonyl-CoA decarboxylase, mitochondrial(Homo sapiens (Human))
Chugai Pharma Usa
Curated by ChEMBL
LigandPNGBDBM50202806(2-(N-isobutyl-4-(2,2,2-trifluoroacetyl)benzamido)e...)
Affinity DataIC50:  80nM. Assay description: Inhibition of MBP fused human MCD
In DepthDetails ArticlePubMed