BDBM50202818 CHEMBL245823::N-(furan-2-ylmethyl)-4-(2,2,2-trifluoroacetyl)benzamide
SMILES FC(F)(F)C(=O)c1ccc(cc1)C(=O)NCc1ccco1
InChI Key InChIKey=PEDVJRWCJBHDOH-UHFFFAOYSA-N
Data  1 IC50
  Tab Delimited (TSV)   2D SDfile   Computed 3D by Vconf -m prep SDfile
Find this compound or compounds like it in BindingDB:
Activity Spreadsheet -- Enzyme Inhibition Constant Data from BindingDB
Found 1 hit for monomerid = 50202818
TargetMalonyl-CoA decarboxylase, mitochondrial(Homo sapiens (Human))
Chugai Pharma Usa
Curated by ChEMBL
LigandPNGBDBM50202818(CHEMBL245823 | N-(furan-2-ylmethyl)-4-(2,2,2-trifl...)
Affinity DataIC50:  2.03E+3nM. Assay description: Inhibition of MBP fused human MCD
In DepthDetails ArticlePubMed