BDBM50202820 CHEMBL246034::N-ethyl-N-(2-hydroxy-2-methylpropyl)-4-(2,2,2-trifluoroacetyl)benzamide
SMILES CCN(CC(C)(C)O)C(=O)c1ccc(cc1)C(=O)C(F)(F)F
InChI Key InChIKey=IGOKNJQCAROEMZ-UHFFFAOYSA-N
Data  1 IC50
  Tab Delimited (TSV)   2D SDfile   Computed 3D by Vconf -m prep SDfile
Find this compound or compounds like it in BindingDB:
Activity Spreadsheet -- Enzyme Inhibition Constant Data from BindingDB
Found 1 hit for monomerid = 50202820
TargetMalonyl-CoA decarboxylase, mitochondrial(Homo sapiens (Human))
Chugai Pharma Usa
Curated by ChEMBL
LigandPNGBDBM50202820(CHEMBL246034 | N-ethyl-N-(2-hydroxy-2-methylpropyl...)
Affinity DataIC50:  399nM. Assay description: Inhibition of MBP fused human MCD
In DepthDetails ArticlePubMed