BDBM50203163 (S)-2-((S)-4-amino-2-((S)-2,4-diamino-4-oxobutanamido)-4-oxobutanamido)propanoic acid::CHEMBL375895
SMILES C[C@H](NC(=O)[C@H](CC(N)=O)NC(=O)[C@@H](N)CC(N)=O)C(O)=O
InChI Key InChIKey=ZZXMOQIUIJJOKZ-ZLUOBGJFSA-N
Data  3 KI
  Tab Delimited (TSV)   2D SDfile   Computed 3D by Vconf -m prep SDfile
Find this compound or compounds like it in BindingDB:
Activity Spreadsheet -- Enzyme Inhibition Constant Data from BindingDB
Found 3 hits for monomerid = 50203163
TargetNitric oxide synthase, brain(Rattus norvegicus (rat))
Northwestern University
Curated by ChEMBL
LigandPNGBDBM50203163((S)-2-((S)-4-amino-2-((S)-2,4-diamino-4-oxobutanam...)
Affinity DataKi:  610nM. Assay description: Inhibition of rat recombinant nNOS expressed in Escherichia coli assessed as nitric oxide production by hemoglobin capture assay
In DepthDetails ArticlePubMed
TargetNitric oxide synthase, endothelial(Bos taurus (bovine))
Northwestern University
Curated by ChEMBL
LigandPNGBDBM50203163((S)-2-((S)-4-amino-2-((S)-2,4-diamino-4-oxobutanam...)
Affinity DataKi:  720nM. Assay description: Inhibition of bovine recombinant eNOS expressed in Escherichia coli assessed as nitric oxide production by hemoglobin capture assay
In DepthDetails ArticlePubMed
TargetNitric oxide synthase, inducible(Mus musculus (mouse))
Northwestern University
Curated by ChEMBL
LigandPNGBDBM50203163((S)-2-((S)-4-amino-2-((S)-2,4-diamino-4-oxobutanam...)
Affinity DataKi:  4.28E+3nM. Assay description: Inhibition of mouse recombinant iNOS expressed in Escherichia coli assessed as nitric oxide production by hemoglobin capture assay
In DepthDetails ArticlePubMed