BDBM50203452 CHEMBL3972633
SMILES CN1CCN(Cc2ccc(NC(=O)c3ccc(C)c(c3)-c3noc(n3)-c3cccnc3)cc2C(F)(F)F)CC1
InChI Key InChIKey=XOGNNBCHPSSEAU-UHFFFAOYSA-N
Data  1 IC50
  Tab Delimited (TSV)   2D SDfile   Computed 3D by Vconf -m prep SDfile
Find this compound or compounds like it in BindingDB:
Activity Spreadsheet -- Enzyme Inhibition Constant Data from BindingDB
Found 1 hit for monomerid = 50203452
TargetProto-oncogene tyrosine-protein kinase receptor Ret(Homo sapiens (Human))
Ocean University Of China
Curated by ChEMBL
LigandPNGBDBM50203452(CHEMBL3972633)
Affinity DataIC50:  108nM. Assay description: Inhibition of RET (unknown origin) using poly[Glu:Tyr] (4:1) as substrate after 60 mins by ELISA
In DepthDetails ArticlePubMed