BDBM50203456 CHEMBL3987007
SMILES COCCOc1cncc(c1)-c1nc(no1)-c1cc(ccc1Cl)C(=O)Nc1ccc(CN2CCN(C)CC2)c(c1)C(F)(F)F
InChI Key InChIKey=QVENJCIVTCIHKR-UHFFFAOYSA-N
Data  1 IC50
  Tab Delimited (TSV)   2D SDfile   Computed 3D by Vconf -m prep SDfile
Find this compound or compounds like it in BindingDB:
Activity Spreadsheet -- Enzyme Inhibition Constant Data from BindingDB
Found 1 hit for monomerid = 50203456
TargetProto-oncogene tyrosine-protein kinase receptor Ret(Homo sapiens (Human))
Ocean University Of China
Curated by ChEMBL
LigandPNGBDBM50203456(CHEMBL3987007)
Affinity DataIC50:  11nM. Assay description: Inhibition of RET (unknown origin) using poly[Glu:Tyr] (4:1) as substrate after 60 mins by ELISA
In DepthDetails ArticlePubMed