BDBM50203706 CHEMBL3900541
SMILES [H][C@@]12CCO[C@@]1(N=C(N)SC2)c1cc(F)cc(NC(=O)c2ccc(Cl)cn2)c1
InChI Key InChIKey=FCQIBOAFXQYMPL-XTZNXHDOSA-N
Data  1 IC50
  Tab Delimited (TSV)   2D SDfile   Computed 3D by Vconf -m prep SDfile
Find this compound or compounds like it in BindingDB:
Activity Spreadsheet -- Enzyme Inhibition Constant Data from BindingDB
Found 1 hit for monomerid = 50203706
TargetBeta-secretase 1(Homo sapiens (Human))
Bristol-Myers Squibb
Curated by ChEMBL
LigandPNGBDBM50203706(CHEMBL3900541)
Affinity DataIC50:  600nM. Assay description: Inhibition of BACE1 (unknown origin)
In DepthDetails ArticlePubMed