BDBM50204363 CHEMBL3974298
SMILES Cc1cc(C)c2c(n1)sn(CCC(=O)N1CCN(CC1)c1cccc(Cl)c1)c2=O
InChI Key InChIKey=JORTVCJHAJIOJY-UHFFFAOYSA-N
Data  4 IC50
  Tab Delimited (TSV)   2D SDfile   Computed 3D by Vconf -m prep SDfile
Find this compound or compounds like it in BindingDB:
Activity Spreadsheet -- Enzyme Inhibition Constant Data from BindingDB
Found 4 hits for monomerid = 50204363
TargetProstaglandin G/H synthase 2(Homo sapiens (Human))
Wroclaw Medical University
Curated by ChEMBL
LigandPNGBDBM50204363(CHEMBL3974298)
Affinity DataIC50:  3.88E+5nM. Assay description: Inhibition of COX-2 (unknown origin) using arachidonic acid as substrate preincubated for 2 mins followed by substrate addition in presence of TMPD b...
In DepthDetails ArticlePubMed
TargetProstaglandin G/H synthase 1(Homo sapiens (Human))
Wroclaw Medical University
Curated by ChEMBL
LigandPNGBDBM50204363(CHEMBL3974298)
Affinity DataIC50:  2.42E+5nM. Assay description: Inhibition of COX-1 (unknown origin) using arachidonic acid as substrate preincubated for 2 mins followed by substrate addition in presence of TMPD b...
In DepthDetails ArticlePubMed
TargetProstaglandin G/H synthase 2(Homo sapiens (Human))
Wroclaw Medical University
Curated by ChEMBL
LigandPNGBDBM50204363(CHEMBL3974298)
Affinity DataIC50:  3.88E+5nM. Assay description: Inhibition of COX-2 (unknown origin) using arachidonic acid as substrate preincubated for 2 mins followed by substrate addition in presence of TMPD b...
In DepthDetails ArticlePubMed
TargetProstaglandin G/H synthase 1(Homo sapiens (Human))
Wroclaw Medical University
Curated by ChEMBL
LigandPNGBDBM50204363(CHEMBL3974298)
Affinity DataIC50:  2.41E+5nM. Assay description: Inhibition of COX-1 (unknown origin) using arachidonic acid as substrate preincubated for 2 mins followed by substrate addition in presence of TMPD b...
In DepthDetails ArticlePubMed