BDBM50205549 3-((3-bromothiophen-2-yl)methylene)indolin-2-one::CHEMBL230414
SMILES Brc1ccsc1\C=C1\C(=O)Nc2ccccc12
InChI Key InChIKey=ZGCKMTQNGWQKEN-VQHVLOKHSA-N
Data  1 IC50
  Tab Delimited (TSV)   2D SDfile   Computed 3D by Vconf -m prep SDfile
Find this compound or compounds like it in BindingDB:
Activity Spreadsheet -- Enzyme Inhibition Constant Data from BindingDB
Found 1 hit for monomerid = 50205549
TargetVascular endothelial growth factor receptor 2(Homo sapiens (Human))
Shanghai Jiao Tong University
Curated by ChEMBL
LigandPNGBDBM50205549(3-((3-bromothiophen-2-yl)methylene)indolin-2-one |...)
Affinity DataIC50:  1.54E+4nM. Assay description: Inhibition of KDR
In DepthDetails ArticlePubMed