BDBM50206685 (S)-N-methyl-3-(4-oxo-6-(4-(trifluoromethoxy)phenyl)thieno[3,2-d]pyrimidin-3(4H)-yl)-N-((S)-1-(tetrahydro-2H-pyran-4-yl)pyrrolidin-3-yl)pyrrolidine-1-carboxamide::CHEMBL234920
SMILES CN([C@H]1CCN(C1)C1CCOCC1)C(=O)N1CC[C@@H](C1)n1cnc2cc(sc2c1=O)-c1ccc(OC(F)(F)F)cc1
InChI Key InChIKey=CFOQOXJLTXXJTH-SFTDATJTSA-N
Data  1 KI
  Tab Delimited (TSV)   2D SDfile   Computed 3D by Vconf -m prep SDfile
Find this compound or compounds like it in BindingDB:
Activity Spreadsheet -- Enzyme Inhibition Constant Data from BindingDB
Found 1 hit for monomerid = 50206685
TargetMelanin-concentrating hormone receptor 1(Homo sapiens (Human))
Neurocrine Biosciences
Curated by ChEMBL
LigandPNGBDBM50206685((S)-N-methyl-3-(4-oxo-6-(4-(trifluoromethoxy)pheny...)
Affinity DataKi:  18nM. Assay description: Binding affinity to human MCHR1
In DepthDetails ArticlePubMed