BDBM50206695 (S)-3-(6-(2,3-dihydrobenzo[b][1,4]dioxin-6-yl)-4-oxothieno[3,2-d]pyrimidin-3(4H)-yl)-N-methyl-N-((S)-1-methylpyrrolidin-3-yl)pyrrolidine-1-carboxamide::CHEMBL232231
SMILES CN([C@H]1CCN(C)C1)C(=O)N1CC[C@@H](C1)n1cnc2cc(sc2c1=O)-c1ccc2OCCOc2c1
InChI Key InChIKey=DGSRCDJRAQTECN-ROUUACIJSA-N
Data  1 KI
  Tab Delimited (TSV)   2D SDfile   Computed 3D by Vconf -m prep SDfile
Find this compound or compounds like it in BindingDB:
Activity Spreadsheet -- Enzyme Inhibition Constant Data from BindingDB
Found 1 hit for monomerid = 50206695
TargetMelanin-concentrating hormone receptor 1(Homo sapiens (Human))
Neurocrine Biosciences
Curated by ChEMBL
LigandPNGBDBM50206695((S)-3-(6-(2,3-dihydrobenzo[b][1,4]dioxin-6-yl)-4-o...)
Affinity DataKi:  143nM. Assay description: Binding affinity to human MCHR1
In DepthDetails ArticlePubMed