BDBM50208852 (R)-N-((S)-1-benzyl-3-cyanopyrrolidin-3-yl)-2-(cyclohexylmethyl)-4-morpholino-4-oxobutanamide::CHEMBL234694
SMILES O=C(C[C@@H](CC1CCCCC1)C(=O)N[C@]1(CCN(Cc2ccccc2)C1)C#N)N1CCOCC1
InChI Key InChIKey=HXJDUXHBBDAQJP-SHQCIBLASA-N
Data  1 IC50  1 Kd
  Tab Delimited (TSV)   2D SDfile   Computed 3D by Vconf -m prep SDfile
Find this compound or compounds like it in BindingDB:
Activity Spreadsheet -- Enzyme Inhibition Constant Data from BindingDB
Found 1 hit for monomerid = 50208852
TargetCathepsin S(Homo sapiens (Human))
Boehringer Ingelheim Pharmaceuticals
Curated by ChEMBL
LigandPNGBDBM50208852((R)-N-((S)-1-benzyl-3-cyanopyrrolidin-3-yl)-2-(cyc...)
Affinity DataIC50:  29nM. Assay description: Inhibition of human cathepsin S
In DepthDetails ArticlePubMed