BDBM50210929 CHEMBL3914106
SMILES Cc1ccnc(NS(=O)(=O)c2ccc(N\C=C/C(=O)c3cc4ccccc4oc3=O)cc2)n1
InChI Key InChIKey=AXFIJMAAXHZPPP-QBFSEMIESA-N
Data  1 IC50
  Tab Delimited (TSV)   2D SDfile   Computed 3D by Vconf -m prep SDfile
Find this compound or compounds like it in BindingDB:
Activity Spreadsheet -- Enzyme Inhibition Constant Data from BindingDB
Found 1 hit for monomerid = 50210929
TargetAromatase(Homo sapiens (Human))
King Saud University
Curated by ChEMBL
LigandPNGBDBM50210929(CHEMBL3914106)
Affinity DataIC50:  9.52E+3nM. Assay description: Inhibition of aromatase activity in human T47D cells after 24 hrs
In DepthDetails ArticlePubMed