BDBM50211556 CHEMBL390402::[(R)-1-[(S)-2-(2-aminomethyl-5-chloro-benzylcarbamoyl)-pyrrolidine-1-carbonyl]-3-(1-oxy-pyridin-2-yl)-propylamino]-acetic acid
SMILES NCc1ccc(Cl)cc1CNC(=O)[C@@H]1CCCN1C(=O)[C@@H](CCc1cccc[n+]1[O-])NCC(O)=O
InChI Key InChIKey=JCHJGPGQBMUBTD-RTWAWAEBSA-N
Data  3 KI
  Tab Delimited (TSV)   2D SDfile   Computed 3D by Vconf -m prep SDfile
Find this compound or compounds like it in BindingDB:
Activity Spreadsheet -- Enzyme Inhibition Constant Data from BindingDB
Found 3 hits for monomerid = 50211556
TargetCoagulation factor X(Homo sapiens (Human))
Curacyte Discovery
Curated by ChEMBL
LigandPNGBDBM50211556(CHEMBL390402 | [(R)-1-[(S)-2-(2-aminomethyl-5-chlo...)
Affinity DataKi:  0.940nM. Assay description: Inhibition of factor 10a
In DepthDetails ArticlePubMed
TargetProthrombin(Homo sapiens (Human))
Curacyte Discovery
Curated by ChEMBL
LigandPNGBDBM50211556(CHEMBL390402 | [(R)-1-[(S)-2-(2-aminomethyl-5-chlo...)
Affinity DataKi:  17.3nM. Assay description: Inhibition of thrombin
In DepthDetails ArticlePubMed
TargetUrokinase-type plasminogen activator(Homo sapiens (Human))
Curacyte Discovery
Curated by ChEMBL
LigandPNGBDBM50211556(CHEMBL390402 | [(R)-1-[(S)-2-(2-aminomethyl-5-chlo...)
Affinity DataKi: >5.00E+3nM. Assay description: Inhibition of uPA
In DepthDetails ArticlePubMed