BDBM50211572 (4-{[1-{[(2-aminomethyl-5-chloro-benzylcarbamoyl)-methyl]-carbamoyl}-3-(1-oxy-pyridin-2-yl)-propylsulfamoyl]-methyl}-phenyl)-acetic acid::CHEMBL388481
SMILES NCc1ccc(Cl)cc1CNC(=O)CNC(=O)C(CCc1cccc[n+]1[O-])NS(=O)(=O)Cc1ccc(CC(O)=O)cc1
InChI Key InChIKey=VZKGCPIPMOIXSZ-UHFFFAOYSA-N
Data  3 KI
  Tab Delimited (TSV)   2D SDfile   Computed 3D by Vconf -m prep SDfile
Find this compound or compounds like it in BindingDB:
Activity Spreadsheet -- Enzyme Inhibition Constant Data from BindingDB
Found 3 hits for monomerid = 50211572
TargetCoagulation factor X(Homo sapiens (Human))
Curacyte Discovery
Curated by ChEMBL
LigandPNGBDBM50211572((4-{[1-{[(2-aminomethyl-5-chloro-benzylcarbamoyl)-...)
Affinity DataKi:  0.360nM. Assay description: Inhibition of factor 10a
In DepthDetails ArticlePubMed
TargetProthrombin(Homo sapiens (Human))
Curacyte Discovery
Curated by ChEMBL
LigandPNGBDBM50211572((4-{[1-{[(2-aminomethyl-5-chloro-benzylcarbamoyl)-...)
Affinity DataKi:  930nM. Assay description: Inhibition of thrombin
In DepthDetails ArticlePubMed
TargetUrokinase-type plasminogen activator(Homo sapiens (Human))
Curacyte Discovery
Curated by ChEMBL
LigandPNGBDBM50211572((4-{[1-{[(2-aminomethyl-5-chloro-benzylcarbamoyl)-...)
Affinity DataKi: >5.00E+3nM. Assay description: Inhibition of uPA
In DepthDetails ArticlePubMed