BDBM50211752 (2E)-3-[(1R,2S,7S,8S,9S)-3,3,7-trimethyltricyclo[5.4.0.02,9]undec-8-yl]prop-2-en-1-ol::CHEMBL225521
SMILES C[C@]12CCCC(C)(C)[C@H]3[C@H](CC[C@@H]13)[C@@H]2\C=C\CO
InChI Key InChIKey=DIYJBQPLTIANER-BKRXEKPUSA-N
Data  1 IC50
  Tab Delimited (TSV)   2D SDfile   Computed 3D by Vconf -m prep SDfile
Find this compound or compounds like it in BindingDB:
Activity Spreadsheet -- Enzyme Inhibition Constant Data from BindingDB
Found 1 hit for monomerid = 50211752
TargetUDP-glucuronosyltransferase 2B7(Homo sapiens (Human))
University Of Helsinki
Curated by ChEMBL
LigandPNGBDBM50211752((2E)-3-[(1R,2S,7S,8S,9S)-3,3,7-trimethyltricyclo[5...)
Affinity DataIC50:  800nM. Assay description: Inhibition of human UGT2B7 assessed as reduction of estriol glucuronidation
In DepthDetails ArticlePubMed