BDBM50211769 (1R)-1-[(1R,2S,7S,8S,9S)-3,3,7-trimethyltricyclo[5.4.0.02,9]undec-8-yl]propan-1-ol::CHEMBL449400
SMILES CC[C@@H](O)[C@H]1[C@H]2CC[C@@H]3[C@H]2C(C)(C)CCC[C@]13C
InChI Key InChIKey=NLRJGBFARIFMGP-YXJUNQHRSA-N
Data  1 IC50
  Tab Delimited (TSV)   2D SDfile   Computed 3D by Vconf -m prep SDfile
Find this compound or compounds like it in BindingDB:
Activity Spreadsheet -- Enzyme Inhibition Constant Data from BindingDB
Found 1 hit for monomerid = 50211769
TargetUDP-glucuronosyltransferase 2B7(Homo sapiens (Human))
University Of Helsinki
Curated by ChEMBL
LigandPNGBDBM50211769((1R)-1-[(1R,2S,7S,8S,9S)-3,3,7-trimethyltricyclo[5...)
Affinity DataIC50:  500nM. Assay description: Inhibition of human UGT2B7 assessed as reduction of estriol glucuronidation
In DepthDetails ArticlePubMed