BDBM50211783 4-[(1R,2S,7R,8S,9R)-3,3,7-trimethyltricyclo[5.4.0.02,9]undec-8-yl]butanoic acid::CHEMBL226226
SMILES C[C@]12CCCC(C)(C)[C@H]3[C@H](CC[C@@H]13)[C@@H]2CCCC(O)=O
InChI Key InChIKey=OOIIPMKMMHXCIM-WVYJYSKYSA-N
Data  1 IC50
  Tab Delimited (TSV)   2D SDfile   Computed 3D by Vconf -m prep SDfile
Find this compound or compounds like it in BindingDB:
Activity Spreadsheet -- Enzyme Inhibition Constant Data from BindingDB
Found 1 hit for monomerid = 50211783
TargetUDP-glucuronosyltransferase 2B7(Homo sapiens (Human))
University Of Helsinki
Curated by ChEMBL
LigandPNGBDBM50211783(4-[(1R,2S,7R,8S,9R)-3,3,7-trimethyltricyclo[5.4.0....)
Affinity DataIC50:  1.60E+4nM. Assay description: Inhibition of human UGT2B7 assessed as reduction of estriol glucuronidation
In DepthDetails ArticlePubMed