BDBM50214936 (Z)-5-(3-(trifluoromethyl)benzylidene)-10-methoxy-2,2,4-trimethyl-2,4a,5,12a-tetrahydro-1H-chromeno[3,4-f]quinolin-9-ol::CHEMBL232761
SMILES COc1c(O)ccc2O\C(=C/c3cccc(c3)C(F)(F)F)C3=C(C=CC4NC(C)(C)C=C(C)C34)c12
InChI Key InChIKey=LWYMVPVXPCMYJE-XKZIYDEJSA-N
Data  1 KI  2 IC50  2 EC50
  Tab Delimited (TSV)   2D SDfile   Computed 3D by Vconf -m prep SDfile
Find this compound or compounds like it in BindingDB:
Activity Spreadsheet -- Enzyme Inhibition Constant Data from BindingDB
Found 5 hits for monomerid = 50214936
TargetGlucocorticoid receptor(Homo sapiens (Human))
Ligand Pharmaceuticals
Curated by ChEMBL
LigandPNGBDBM50214936((Z)-5-(3-(trifluoromethyl)benzylidene)-10-methoxy-...)
Affinity DataKi:  2.70nM. Assay description: Displacement of radiolabeled dexamethasone from glucocorticoid receptor
In DepthDetails ArticlePubMed
TargetGlucocorticoid receptor(Homo sapiens (Human))
Ligand Pharmaceuticals
Curated by ChEMBL
LigandPNGBDBM50214936((Z)-5-(3-(trifluoromethyl)benzylidene)-10-methoxy-...)
Affinity DataIC50:  4.10nM. Assay description: Activity at GR assessed as repression of TNFalpha and IL 1beta induced E-selectin response
In DepthDetails ArticlePubMed
TargetGlucocorticoid receptor(Homo sapiens (Human))
Ligand Pharmaceuticals
Curated by ChEMBL
LigandPNGBDBM50214936((Z)-5-(3-(trifluoromethyl)benzylidene)-10-methoxy-...)
Affinity DataEC50: >1.00E+3nM. Assay description: Agonist activity at GR by GRE activation assay
In DepthDetails ArticlePubMed
TargetGlucocorticoid receptor(Homo sapiens (Human))
Ligand Pharmaceuticals
Curated by ChEMBL
LigandPNGBDBM50214936((Z)-5-(3-(trifluoromethyl)benzylidene)-10-methoxy-...)
Affinity DataEC50: >1.00E+3nM. Assay description: Agonist activity at GR by GRE activation assay relative to dexamethasone
In DepthDetails ArticlePubMed
TargetGlucocorticoid receptor(Homo sapiens (Human))
Ligand Pharmaceuticals
Curated by ChEMBL
LigandPNGBDBM50214936((Z)-5-(3-(trifluoromethyl)benzylidene)-10-methoxy-...)
Affinity DataIC50:  2.5nM. Assay description: Antagonist activity at GR assessed as inhibition of dexamethasone-induced GRE activation
In DepthDetails ArticlePubMed