BDBM50214945 10-methoxy-2,2,4-trimethyl-5-[1-p-tolyl-meth-(Z)-ylidene]-2,4a,5,12a-tetrahydro-1H-6-oxa-1-aza-chrysen-9-ol::CHEMBL231976
SMILES COc1c(O)ccc2O\C(=C/c3ccc(C)cc3)C3=C(C=CC4NC(C)(C)C=C(C)C34)c12
InChI Key InChIKey=ZVTZHOAJVOFUEH-UCQKPKSFSA-N
Data  1 KI  2 IC50  1 EC50
  Tab Delimited (TSV)   2D SDfile   Computed 3D by Vconf -m prep SDfile
Find this compound or compounds like it in BindingDB:
Activity Spreadsheet -- Enzyme Inhibition Constant Data from BindingDB
Found 4 hits for monomerid = 50214945
TargetGlucocorticoid receptor(Homo sapiens (Human))
Ligand Pharmaceuticals
Curated by ChEMBL
LigandPNGBDBM50214945(10-methoxy-2,2,4-trimethyl-5-[1-p-tolyl-meth-(Z)-y...)
Affinity DataKi:  1.90nM. Assay description: Displacement of radiolabeled dexamethasone from glucocorticoid receptor
In DepthDetails ArticlePubMed
TargetGlucocorticoid receptor(Homo sapiens (Human))
Ligand Pharmaceuticals
Curated by ChEMBL
LigandPNGBDBM50214945(10-methoxy-2,2,4-trimethyl-5-[1-p-tolyl-meth-(Z)-y...)
Affinity DataEC50:  38nM. Assay description: Agonist activity at GR by GRE activation assay
In DepthDetails ArticlePubMed
TargetGlucocorticoid receptor(Homo sapiens (Human))
Ligand Pharmaceuticals
Curated by ChEMBL
LigandPNGBDBM50214945(10-methoxy-2,2,4-trimethyl-5-[1-p-tolyl-meth-(Z)-y...)
Affinity DataIC50:  12nM. Assay description: Antagonist activity at GR assessed as inhibition of dexamethasone-induced GRE activation
In DepthDetails ArticlePubMed
TargetGlucocorticoid receptor(Homo sapiens (Human))
Ligand Pharmaceuticals
Curated by ChEMBL
LigandPNGBDBM50214945(10-methoxy-2,2,4-trimethyl-5-[1-p-tolyl-meth-(Z)-y...)
Affinity DataIC50:  15nM. Assay description: Activity at GR assessed as repression of TNFalpha and IL 1beta induced E-selectin response
In DepthDetails ArticlePubMed