BDBM50215309 CHEMBL102193
SMILES Cc1ccc(NS(=O)(=O)c2ccc3OCCc3c2)c(=O)n1CC(=O)NCc1ccc2[nH]nc(N)c2c1
InChI Key InChIKey=VDXAXVGFABNSET-UHFFFAOYSA-N
Data  1 KI
  Tab Delimited (TSV)   2D SDfile   Computed 3D by Vconf -m prep SDfile
Find this compound or compounds like it in BindingDB:
Activity Spreadsheet -- Enzyme Inhibition Constant Data from BindingDB
Found 1 hit for monomerid = 50215309
TargetProthrombin(Homo sapiens (Human))
Corvas International
Curated by ChEMBL
LigandPNGBDBM50215309(CHEMBL102193)
Affinity DataKi:  29nM. Assay description: In vitro inhibitory activity against human Thrombin (FIIa) cleavage of the chromogenic substrate
In DepthDetails ArticlePubMed