BDBM50216006 CHEMBL247946::cis-N-(1-isopropyl-4-(5-thioxo-4,5-dihydro-1H-1,2,4-triazol-3-yl)piperidin-3-yl)-4-((2-methylquinolin-4-yl)methoxy)benzamide
SMILES CC(C)N1CC[C@@H]([C@@H](C1)NC(=O)c1ccc(OCc2cc(C)nc3ccccc23)cc1)c1n[nH]c(=S)[nH]1
InChI Key InChIKey=NBEQYTSXQZAREJ-UKILVPOCSA-N
Data  5 KI  1 IC50
  Tab Delimited (TSV)   2D SDfile   Computed 3D by Vconf -m prep SDfile
Find this compound or compounds like it in BindingDB:
Activity Spreadsheet -- Enzyme Inhibition Constant Data from BindingDB
Found 6 hits for monomerid = 50216006
Target72 kDa type IV collagenase(Homo sapiens (Human))
Bristol-Myers Squibb Pharmaceutical Research Institute
Curated by ChEMBL
LigandPNGBDBM50216006(CHEMBL247946 | cis-N-(1-isopropyl-4-(5-thioxo-4,5-...)
Affinity DataKi: >3.33E+3nM. Assay description: Inhibition of MMP2
In DepthDetails ArticlePubMed
TargetStromelysin-1(Homo sapiens (Human))
Bristol-Myers Squibb Pharmaceutical Research Institute
Curated by ChEMBL
LigandPNGBDBM50216006(CHEMBL247946 | cis-N-(1-isopropyl-4-(5-thioxo-4,5-...)
Affinity DataKi: >4.50E+3nM. Assay description: Inhibition of MMP3
In DepthDetails ArticlePubMed
TargetCollagenase 3(Homo sapiens (Human))
Bristol-Myers Squibb Pharmaceutical Research Institute
Curated by ChEMBL
LigandPNGBDBM50216006(CHEMBL247946 | cis-N-(1-isopropyl-4-(5-thioxo-4,5-...)
Affinity DataKi: >5.03E+3nM. Assay description: Inhibition of MMP13
In DepthDetails ArticlePubMed
TargetMacrophage metalloelastase(Homo sapiens (Human))
Bristol-Myers Squibb Pharmaceutical Research Institute
Curated by ChEMBL
LigandPNGBDBM50216006(CHEMBL247946 | cis-N-(1-isopropyl-4-(5-thioxo-4,5-...)
Affinity DataKi: >6.02E+3nM. Assay description: Inhibition of MMP12
In DepthDetails ArticlePubMed
TargetMatrilysin(Homo sapiens (Human))
Bristol-Myers Squibb Pharmaceutical Research Institute
Curated by ChEMBL
LigandPNGBDBM50216006(CHEMBL247946 | cis-N-(1-isopropyl-4-(5-thioxo-4,5-...)
Affinity DataKi: >6.37E+3nM. Assay description: Inhibition of MMP7
In DepthDetails ArticlePubMed
TargetDisintegrin and metalloproteinase domain-containing protein 17(Sus scrofa (pig))
Bristol-Myers Squibb Pharmaceutical Research Institute
Curated by ChEMBL
LigandPNGBDBM50216006(CHEMBL247946 | cis-N-(1-isopropyl-4-(5-thioxo-4,5-...)
Affinity DataIC50:  31nM. Assay description: Inhibition of porcine TACE
In DepthDetails ArticlePubMed