BDBM50216199 4-(2-aza-bicyclo[2.2.1]heptan-2-ylmethyl)-N-(2-methoxyphenethyl)-N-(pyrrolidin-3-yl)benzamide::CHEMBL233421
SMILES COc1ccccc1CCN(C1CCNC1)C(=O)c1ccc(CN2CC3CCC2C3)cc1
InChI Key InChIKey=QSLYLGFILBHTHP-UHFFFAOYSA-N
Data  1 IC50
  Tab Delimited (TSV)   2D SDfile   Computed 3D by Vconf -m prep SDfile
Find this compound or compounds like it in BindingDB:
Activity Spreadsheet -- Enzyme Inhibition Constant Data from BindingDB
Found 1 hit for monomerid = 50216199
TargetMembrane-bound transcription factor site-1 protease(Homo sapiens (Human))
Pfizer
Curated by ChEMBL
LigandPNGBDBM50216199(4-(2-aza-bicyclo[2.2.1]heptan-2-ylmethyl)-N-(2-met...)
Affinity DataIC50:  95nM. Assay description: Inhibition of human S1P expressed in CHOK1 cells
In DepthDetails ArticlePubMed