BDBM50216204 CHEMBL394028::N-(2-methoxyphenethyl)-4-(piperidin-1-ylmethyl)-N-(pyrrolidin-3-yl)benzamide
SMILES COc1ccccc1CCN(C1CCNC1)C(=O)c1ccc(CN2CCCCC2)cc1
InChI Key InChIKey=DRSCCLOMGTZTCW-UHFFFAOYSA-N
Data  1 IC50
  Tab Delimited (TSV)   2D SDfile   Computed 3D by Vconf -m prep SDfile
Find this compound or compounds like it in BindingDB:
Activity Spreadsheet -- Enzyme Inhibition Constant Data from BindingDB
Found 1 hit for monomerid = 50216204
TargetMembrane-bound transcription factor site-1 protease(Homo sapiens (Human))
Pfizer
Curated by ChEMBL
LigandPNGBDBM50216204(CHEMBL394028 | N-(2-methoxyphenethyl)-4-(piperidin...)
Affinity DataIC50:  250nM. Assay description: Inhibition of human S1P expressed in CHOK1 cells
In DepthDetails ArticlePubMed