BDBM50216640 CHEMBL393473::tert-butyl (R)-1-((R)-1-(cyclopropylmethyl)-2-oxo-2,3,4,5-tetrahydro-1H-benzo[b]azepin-3-ylamino)-1-oxo-3-phenylpropan-2-ylcarbamate
SMILES CC(C)(C)OC(=O)N[C@H](Cc1ccccc1)C(=O)N[C@@H]1CCc2ccccc2N(CC2CC2)C1=O
InChI Key InChIKey=IRWNMCDJURTHSX-DHIUTWEWSA-N
Data  1 IC50
  Tab Delimited (TSV)   2D SDfile   Computed 3D by Vconf -m prep SDfile
Find this compound or compounds like it in BindingDB:
Activity Spreadsheet -- Enzyme Inhibition Constant Data from BindingDB
Found 1 hit for monomerid = 50216640
TargetSodium channel protein type 9 subunit alpha(Homo sapiens (Human))
Merck Research Laboratories
Curated by ChEMBL
LigandPNGBDBM50216640(CHEMBL393473 | tert-butyl (R)-1-((R)-1-(cyclopropy...)
Affinity DataIC50:  78nM. Assay description: Blockade of human Nav1.7 by FRET assay
In DepthDetails ArticlePubMed