BDBM50217644 CHEMBL397550::N-(2-chloro-4,5-dimethoxybenzyl)-N-(4-((4-aminocyclohexyl)methyl)cyclohexyl)-4-(1H-indol-3-yl)butanamide
SMILES COc1cc(Cl)c(CN(C2CCC(CC3CCC(N)CC3)CC2)C(=O)CCCc2c[nH]c3ccccc23)cc1OC
InChI Key InChIKey=CAGGFSBFLDCAIQ-UHFFFAOYSA-N
Data  6 KI
  Tab Delimited (TSV)   2D SDfile   Computed 3D by Vconf -m prep SDfile
Find this compound or compounds like it in BindingDB:
Activity Spreadsheet -- Enzyme Inhibition Constant Data from BindingDB
Found 6 hits for monomerid = 50217644
TargetMelanocortin receptor 4(Homo sapiens (Human))
Uppsala University
Curated by ChEMBL
LigandPNGBDBM50217644(CHEMBL397550 | N-(2-chloro-4,5-dimethoxybenzyl)-N-...)
Affinity DataKi:  1.50E+3nM. Assay description: Displacement of [125I]NDP-MSH from human recombinant MC4 receptor expressed in Sf9 cells
In DepthDetails ArticlePubMed
TargetMelanocortin receptor 4(Homo sapiens (Human))
Uppsala University
Curated by ChEMBL
LigandPNGBDBM50217644(CHEMBL397550 | N-(2-chloro-4,5-dimethoxybenzyl)-N-...)
Affinity DataKi:  1.50E+3nM. Assay description: Displacement of [125I]NDP-MSH from human recombinant MC4 receptor expressed in Sf9 cells
In DepthDetails ArticlePubMed
TargetMelanocyte-stimulating hormone receptor(Mus musculus)
Uppsala University
Curated by ChEMBL
LigandPNGBDBM50217644(CHEMBL397550 | N-(2-chloro-4,5-dimethoxybenzyl)-N-...)
Affinity DataKi:  1.90E+3nM. Assay description: Displacement of [125I]NDP-MSH from MC1 receptor in mouse B16 cells
In DepthDetails ArticlePubMed
TargetMelanocortin receptor 5(Homo sapiens (Human))
Uppsala University
Curated by ChEMBL
LigandPNGBDBM50217644(CHEMBL397550 | N-(2-chloro-4,5-dimethoxybenzyl)-N-...)
Affinity DataKi:  8.90E+3nM. Assay description: Displacement of [125I]NDP-MSH from human recombinant MC5 receptor expressed in Sf9 cells
In DepthDetails ArticlePubMed
TargetMelanocortin receptor 5(Homo sapiens (Human))
Uppsala University
Curated by ChEMBL
LigandPNGBDBM50217644(CHEMBL397550 | N-(2-chloro-4,5-dimethoxybenzyl)-N-...)
Affinity DataKi:  8.90E+3nM. Assay description: Displacement of [125I]NDP-MSH from human recombinant MC5 receptor expressed in Sf9 cells
In DepthDetails ArticlePubMed
TargetMelanocortin receptor 3(Homo sapiens (Human))
Uppsala University
Curated by ChEMBL
LigandPNGBDBM50217644(CHEMBL397550 | N-(2-chloro-4,5-dimethoxybenzyl)-N-...)
Affinity DataKi:  2.50E+4nM. Assay description: Displacement of [125I]NDP-MSH from human recombinant MC3 receptor expressed in Sf9 cells
In DepthDetails ArticlePubMed