BDBM50217789 (E)-N-(3-aminopropyl)-2-(1H-indol-3-yl)-N-(2-methyl-3-phenylallyl)-2-oxoacetamide::CHEMBL235815
SMILES C\C(CN(CCCN)C(=O)C(=O)c1c[nH]c2ccccc12)=C/c1ccccc1
InChI Key InChIKey=YCZXQRUWNWMHNK-SAPNQHFASA-N
Data  4 KI
  Tab Delimited (TSV)   2D SDfile   Computed 3D by Vconf -m prep SDfile
Find this compound or compounds like it in BindingDB:
Activity Spreadsheet -- Enzyme Inhibition Constant Data from BindingDB
Found 4 hits for monomerid = 50217789
TargetMelanocyte-stimulating hormone receptor(Mus musculus)
Uppsala University
Curated by ChEMBL
LigandPNGBDBM50217789((E)-N-(3-aminopropyl)-2-(1H-indol-3-yl)-N-(2-methy...)
Affinity DataKi:  1.80E+3nM. Assay description: Displacement of [125I]NDP-MSH from MC1 receptor in mouse B16 cells
In DepthDetails ArticlePubMed
TargetMelanocortin receptor 4(Homo sapiens (Human))
Uppsala University
Curated by ChEMBL
LigandPNGBDBM50217789((E)-N-(3-aminopropyl)-2-(1H-indol-3-yl)-N-(2-methy...)
Affinity DataKi:  6.20E+3nM. Assay description: Displacement of [125I]NDP-MSH from human recombinant MC4 receptor expressed in Sf9 cells
In DepthDetails ArticlePubMed
TargetMelanocortin receptor 3(Homo sapiens (Human))
Uppsala University
Curated by ChEMBL
LigandPNGBDBM50217789((E)-N-(3-aminopropyl)-2-(1H-indol-3-yl)-N-(2-methy...)
Affinity DataKi:  9.10E+3nM. Assay description: Displacement of [125I]NDP-MSH from human recombinant MC3 receptor expressed in Sf9 cells
In DepthDetails ArticlePubMed
TargetMelanocortin receptor 5(Homo sapiens (Human))
Uppsala University
Curated by ChEMBL
LigandPNGBDBM50217789((E)-N-(3-aminopropyl)-2-(1H-indol-3-yl)-N-(2-methy...)
Affinity DataKi:  5.80E+4nM. Assay description: Displacement of [125I]NDP-MSH from human recombinant MC5 receptor expressed in Sf9 cells
In DepthDetails ArticlePubMed