BDBM50218248 CHEMBL69776
SMILES COc1ccc(C(=O)Nc2ccccc2Cl)c2cc(oc12)C(C)=O
InChI Key InChIKey=MPXKKKYXZROOTK-UHFFFAOYSA-N
Data  3 IC50
  Tab Delimited (TSV)   2D SDfile   Computed 3D by Vconf -m prep SDfile
Find this compound or compounds like it in BindingDB:
Activity Spreadsheet -- Enzyme Inhibition Constant Data from BindingDB
Found 3 hits for monomerid = 50218248
TargetcAMP-specific 3',5'-cyclic phosphodiesterase 4C(Rattus norvegicus)
Celltech-Chiroscience
Curated by ChEMBL
LigandPNGBDBM50218248(CHEMBL69776)
Affinity DataIC50:  248nM. Assay description: Inhibition of rolipram binding to rat brain tissue
In DepthDetails ArticlePubMed
LigandPNGBDBM50218248(CHEMBL69776)
Affinity DataIC50:  54nM. Assay description: Inhibition of PDE4 in Homo sapiens (human) U937 cells
In DepthDetails Article
LigandPNGBDBM50218248(CHEMBL69776)
Affinity DataIC50:  54nM. Assay description: Inhibition of Phosphodiesterase 4 from human U937 cells
In DepthDetails ArticlePubMed