BDBM50218254 CHEMBL302799
SMILES COc1ccc(C(=O)Nc2c(Cl)cncc2Cl)c2c(C)c(oc12)C(C)=O
InChI Key InChIKey=WHVLKHKNUNQGLI-UHFFFAOYSA-N
Data  3 IC50
  Tab Delimited (TSV)   2D SDfile   Computed 3D by Vconf -m prep SDfile
Find this compound or compounds like it in BindingDB:
Activity Spreadsheet -- Enzyme Inhibition Constant Data from BindingDB
Found 3 hits for monomerid = 50218254
TargetcAMP-specific 3',5'-cyclic phosphodiesterase 4A/4B/4C/4D(Homo sapiens (Human))
Celltech-Chiroscience
Curated by ChEMBL
LigandPNGBDBM50218254(CHEMBL302799)
Affinity DataIC50:  320nM. Assay description: Inhibition of Phosphodiesterase 4 from human U937 cells
In DepthDetails ArticlePubMed
TargetcAMP-specific 3',5'-cyclic phosphodiesterase 4A/4B/4C/4D(Homo sapiens (Human))
Celltech-Chiroscience
Curated by ChEMBL
LigandPNGBDBM50218254(CHEMBL302799)
Affinity DataIC50:  320nM. Assay description: Inhibition of PDE4 in Homo sapiens (human) U937 cells
In DepthDetails Article
TargetcAMP-specific 3',5'-cyclic phosphodiesterase 4C(Rattus norvegicus)
Celltech-Chiroscience
Curated by ChEMBL
LigandPNGBDBM50218254(CHEMBL302799)
Affinity DataIC50:  160nM. Assay description: Inhibition of rolipram binding in rat brain tissue
In DepthDetails ArticlePubMed