BDBM50218295 5-chloro-N-((3R,4S)-1-isobutyryl-4-(4-(2-oxopyridin-1(2H)-yl)benzamido)pyrrolidin-3-yl)thiophene-2-carboxamide::CHEMBL391635
SMILES CC(C)C(=O)N1C[C@@H](NC(=O)c2ccc(Cl)s2)[C@H](C1)NC(=O)c1ccc(cc1)-n1ccccc1=O
InChI Key InChIKey=KPXGZJJXVMJJCK-RBUKOAKNSA-N
Data  1 KI
  Tab Delimited (TSV)   2D SDfile   Computed 3D by Vconf -m prep SDfile
Find this compound or compounds like it in BindingDB:
Activity Spreadsheet -- Enzyme Inhibition Constant Data from BindingDB
Found 1 hit for monomerid = 50218295
TargetCoagulation factor X(Homo sapiens (Human))
Bristol-Myers Squibb
Curated by ChEMBL
LigandPNGBDBM50218295(5-chloro-N-((3R,4S)-1-isobutyryl-4-(4-(2-oxopyridi...)
Affinity DataKi:  1.30nM. Assay description: Inhibition of human factor 10a
In DepthDetails ArticlePubMed