BDBM50218314 5-chloro-N-((1R,2S,4S)-4-(morpholine-4-carbonyl)-2-(4-(2-oxopyridin-1(2H)-yl)benzamido)cyclopentyl)thiophene-2-carboxamide::CHEMBL538905
SMILES Clc1ccc(s1)C(=O)N[C@@H]1C[C@H](C[C@@H]1NC(=O)c1ccc(cc1)-n1ccccc1=O)C(=O)N1CCOCC1
InChI Key InChIKey=KIRAXNSWURSOKF-SESVDKBCSA-N
Data  1 KI
  Tab Delimited (TSV)   2D SDfile   Computed 3D by Vconf -m prep SDfile
Find this compound or compounds like it in BindingDB:
Activity Spreadsheet -- Enzyme Inhibition Constant Data from BindingDB
Found 1 hit for monomerid = 50218314
TargetCoagulation factor X(Homo sapiens (Human))
Bristol-Myers Squibb
Curated by ChEMBL
LigandPNGBDBM50218314(5-chloro-N-((1R,2S,4S)-4-(morpholine-4-carbonyl)-2...)
Affinity DataKi:  1.60nM. Assay description: Inhibition of human factor 10a
In DepthDetails ArticlePubMed