BDBM50219658 CHEMBL247431::N-(4-(2,4-difluorophenyl)thiazol-2-yl)-4-(pyrimidin-4-ylamino)benzamide
SMILES Fc1ccc(-c2csc(NC(=O)c3ccc(Nc4ccncn4)cc3)n2)c(F)c1
InChI Key InChIKey=OZNWPHBJFYYGNK-UHFFFAOYSA-N
Data  3 EC50
  Tab Delimited (TSV)   2D SDfile   Computed 3D by Vconf -m prep SDfile
Find this compound or compounds like it in BindingDB:
Activity Spreadsheet -- Enzyme Inhibition Constant Data from BindingDB
Found 3 hits for monomerid = 50219658
TargetThrombopoietin receptor(Homo sapiens (Human))
Pfizer
Curated by ChEMBL
LigandPNGBDBM50219658(CHEMBL247431 | N-(4-(2,4-difluorophenyl)thiazol-2-...)
Affinity DataEC50:  170nM. Assay description: Agonist activity at human TPOr expressed in BaF3 cells by reporter assay
In DepthDetails ArticlePubMed
TargetThrombopoietin receptor(Homo sapiens (Human))
Pfizer
Curated by ChEMBL
LigandPNGBDBM50219658(CHEMBL247431 | N-(4-(2,4-difluorophenyl)thiazol-2-...)
Affinity DataEC50:  170nM. Assay description: Agonist activity at TPO receptor
In DepthDetails ArticlePubMed
TargetThrombopoietin receptor(Homo sapiens (Human))
Pfizer
Curated by ChEMBL
LigandPNGBDBM50219658(CHEMBL247431 | N-(4-(2,4-difluorophenyl)thiazol-2-...)
Affinity DataEC50:  173nM. Assay description: Agonist activity at human TPOr expressed in BaF3 cells by reporter assay
In DepthDetails ArticlePubMed