BDBM50219663 CHEMBL248006::N-(4-(2,6-difluorophenyl)thiazol-2-yl)-4-(pyrimidin-4-ylamino)benzamide
SMILES Fc1cccc(F)c1-c1csc(NC(=O)c2ccc(Nc3ccncn3)cc2)n1
InChI Key InChIKey=QIOKNXYOGAVIRC-UHFFFAOYSA-N
Data  2 EC50
  Tab Delimited (TSV)   2D SDfile   Computed 3D by Vconf -m prep SDfile
Find this compound or compounds like it in BindingDB:
Activity Spreadsheet -- Enzyme Inhibition Constant Data from BindingDB
Found 2 hits for monomerid = 50219663
TargetThrombopoietin receptor(Homo sapiens (Human))
Pfizer
Curated by ChEMBL
LigandPNGBDBM50219663(CHEMBL248006 | N-(4-(2,6-difluorophenyl)thiazol-2-...)
Affinity DataEC50: >1.00E+4nM. Assay description: Agonist activity at TPO receptor
In DepthDetails ArticlePubMed
TargetThrombopoietin receptor(Homo sapiens (Human))
Pfizer
Curated by ChEMBL
LigandPNGBDBM50219663(CHEMBL248006 | N-(4-(2,6-difluorophenyl)thiazol-2-...)
Affinity DataEC50: >1.00E+4nM. Assay description: Agonist activity at human TPOr expressed in BaF3 cells by reporter assay
In DepthDetails ArticlePubMed