BDBM50220027 (5R)-3-(4-{6-[(2,4-dimethyl-1H-imidazol-1-yl)acetyl]pyridin-3-yl}-3-fluorophenyl)-5-(1H-1,2,3-triazol-1-ylmethyl)-1,3-oxazo-lidin-2-one::CHEMBL231283
SMILES Cc1cn(CC(=O)c2ccc(cn2)-c2ccc(cc2F)N2C[C@H](Cn3ccnn3)OC2=O)c(C)n1
InChI Key InChIKey=GQBMBLANEWOVCJ-IBGZPJMESA-N
Data  1 KI
  Tab Delimited (TSV)   2D SDfile   Computed 3D by Vconf -m prep SDfile
Find this compound or compounds like it in BindingDB:
Activity Spreadsheet -- Enzyme Inhibition Constant Data from BindingDB
Found 1 hit for monomerid = 50220027
TargetAmine oxidase [flavin-containing] A(Homo sapiens (Human))
Astrazeneca Discovery
Curated by ChEMBL
LigandPNGBDBM50220027((5R)-3-(4-{6-[(2,4-dimethyl-1H-imidazol-1-yl)acety...)
Affinity DataKi: >1.10E+4nM. Assay description: Inhibition of human liver MAOA expressed in yeast
In DepthDetails ArticlePubMed